{"text_format":"1","workbook":"xlsx","n_sheets":16,"sheets":["Autodiagnóstico Ético","Instructivo","Glosario de Términos","Información básica OO.EE","Ficha de Autoevaluación","Rúbrica Principios","Autoevaluación principios ","Riesgo No 1","Riesgo No 2","Riesgo No 3","Riesgo No 4","Riesgo No 5","Riesgo No 6","Riesgo No 7","Riesgo No 8","Riesgo No 9"],"not_rendered":{"charts":0,"images":6,"macros":1,"external_links":0,"defined_names":22,"comments":0,"pivot_tables":0},"unopened":[],"bounds":{"document_bytes":16777216,"sheet_cells":100000,"rows_first":2000,"rows_last":500,"rows_between":2000,"halvings":0,"cell_chars":16384,"cell_head_chars":4096},"cells_cut":0,"cells_raw":0,"read":"whole","date_system":"1900"}

{"sheet":"Autodiagnóstico Ético","index":0,"n_rows":0,"n_cols":0,"rows_kept":0,"cut":false,"hidden":false,"merged":[]}

{"sheet":"Instructivo","index":1,"n_rows":30,"n_cols":3,"rows_kept":30,"cut":false,"hidden":false,"merged":[[26,2,26,11],[2,2,2,11],[11,2,11,11],[12,2,12,11],[14,2,14,11],[18,2,18,11],[3,2,3,11],[7,2,7,11],[4,2,4,11],[5,2,5,11],[6,2,6,11],[25,2,25,11],[16,2,16,11],[24,2,24,11],[8,2,8,11],[9,2,9,11],[23,2,23,11],[17,2,17,11],[10,2,10,11],[13,2,13,11],[21,2,21,11],[20,2,20,11],[19,2,19,11]]}
[]
[]
[null,null,"Instructivo "]
[null,null,"El DANE como mayor productor de estadísticas oficiales del Sistema Estadístico Nacional (SEN) propició la incorporación de la valoración ética en las operaciones estadísticas que produce y difunde, a partir de la implementación de su Sistema de Ética Estadística (SETE), el cual, cuenta con un marco ético conformado por cuatro ejes y 15 principios; e identifica 9 riesgos a los que puede estar expuesta la producción estadística.  El SETE se instauró de forma oficial el 15 de abril de 2021.  Para más información sobre el evento, puede consultar el siguiente enlace: https://www.youtube.com/watch?v=JmjLTGHpJno&t=472s"]
[null,null,"El SETE está conformado por tres instancias: el Comité de Ética Estadística, la Sala de Apelaciones y un Grupo Base. El Comité de Ética Estadística es la primera instancia de deliberación y evaluación ética. Está conformado por 12 miembros: cinco miembros internos con voz y voto; dos miembros externos con voz y voto; dos miembros rotativos con voz y voto (en representación de la sociedad civil para la temática de la operación estadística (O.E) que se somete a evaluación); y tres delegados del DANE (uno de la Oficina Jurídica, uno del área de Gestión Humana y uno de la Dirección de Comunicaciones) con voz y sin voto. "]
[null,null,"La Sala de Apelaciones es la segunda instancia de evaluación para aquellos casos en los que se pide una segunda evaluación, por parte de los responsables de las operaciones estadísticas (OO.EE), quienes manifiestan desacuerdos  frente a las decisiones tomadas por el Comité.  La Sala está conformada por 6 miembros: dos miembros internos con voz y voto, un miembro externo con voz y voto; y, los tres delegados del DANE con voz y sin voto que también participan en el Comité. "]
[null,null,"El grupo base  funge como Secretaría Técnica y se encarga además, de realizar acciones de promoción y apropiación del marco ético estadístico (incluida la asesoría en la realización del autodiagnóstico ético, a través de la presente herramienta); así como también, analizar situaciones con implicaciones éticas en la entidad, que se relacionan con el quehacer misional del DANE.  El grupo base está conformado por cinco miembros: dos expertos externos en ética aplicada y tres miembros internos expertos en estadística.  Para más información sobre el marco ético y la conformación del SETE puede consultar el siguiente enlace:"]
[null,null,"https://www.sen.gov.co/conozca-el-sen/instancias/sete."]
{"$rows_left_out":23}
{"sheet":"Glosario de Términos","index":2,"n_rows":41,"n_cols":4,"rows_kept":41,"cut":false,"hidden":false,"merged":[[3,3,3,4],[2,1,2,4]]}
[]
[]
[null,"Glosario de Términos"]
[null,"Término",null,"Concepto"]
[null,"Accesibilidad",null,"Facilidad con que la información estadística puede ser ubicada y obtenida por los usuarios; contempla la forma en que esta se provee, los medios de difusión, así como la disponibilidad de los metadatos y los servicios de apoyo para su consulta."]
[null,"Actos de discriminación",null,"Impedir, obstruir o restringir arbitrariamente el pleno ejercicio de los derechos de las personas por razón de su raza, nacionalidad, sexo u orientación sexual."]
[null,"Autonomía",null,"Capacidad y derecho de los ciudadanos para establecer reglas de conducta y tomar decisiones por sí mismos en cuanto a sus relaciones con otros y con el Estado."]
[null,"Conflicto de intereses",null,"Situación en la que se puede encontrar un servidor y en la que el interés público que debe atender se opone a su interés particular y que podría influenciar indebidamente en el ejercicio de sus funciones y responsabilidades oficiales."]
{"$rows_left_out":34}
{"sheet":"Información básica OO.EE","index":3,"n_rows":66,"n_cols":7,"rows_kept":66,"cut":false,"hidden":false,"merged":[[2,2,2,11],[4,3,4,6],[64,6,64,8],[9,3,9,11],[13,3,13,11],[15,3,15,11],[20,3,20,11],[11,3,11,11],[65,6,65,8],[26,2,28,11],[35,2,37,11],[49,2,51,11],[53,2,55,11],[57,2,59,11],[30,2,33,11],[39,2,42,11],[44,2,47,11]]}
[]
[]
[null,null,"Información básica OO.EE"]
[]
[null,null,"Código SETE"]
[]
[null,null,"Operación Estadística (OO.EE)"]
[]
{"$rows_left_out":59}
{"sheet":"Ficha de Autoevaluación","index":4,"n_rows":70,"n_cols":9,"rows_kept":70,"cut":false,"hidden":false,"merged":[[2,1,2,11],[21,5,21,11],[22,5,22,11],[20,5,20,11],[3,2,3,5],[5,2,5,11],[15,5,15,11],[16,5,16,11],[17,5,17,11],[19,5,19,11],[9,1,10,1],[12,5,12,11],[13,5,13,11],[14,5,14,11],[9,8,10,8],[23,5,23,11],[24,5,24,11],[25,5,25,11],[62,2,62,9],[64,2,64,9],[35,5,35,11],[36,5,36,11],[28,5,28,11],[29,5,29,11],[30,5,30,11],[31,5,31,11],[33,5,33,11],[34,5,34,11],[27,5,27,11],[69,2,69,9],[43,1,44,1],[47,5,47,11],[54,5,54,11],[55,5,55,11],[56,5,56,11],[43,8,44,8],[48,5,48,11],[49,5,49,11],[50,5,50,11],[51,5,51,11],[52,5,52,11],[53,5,53,11]]}
[]
[]
[null,"Ficha de Autoevaluación"]
[null,"Código SETE",{"$f":"IFERROR(VLOOKUP($B4,'Información básica OO.EE'!C5:G5,2,0),\" \")","v":0}]
[]
[null,"Nombre OO.EE",{"$f":"IFERROR(VLOOKUP(B6,'Información básica OO.EE'!C10:L10,2,0),\"\")","v":0}]
[]
[null,"Apropiación de los Principios Éticos en la operación estadística"]
{"$rows_left_out":63}
{"sheet":"Rúbrica Principios","index":5,"n_rows":46,"n_cols":8,"rows_kept":46,"cut":false,"hidden":false,"merged":[[25,7,25,8],[26,7,26,8],[2,1,2,11],[7,5,7,11],[8,5,8,11],[9,5,9,11],[10,5,10,11],[11,5,11,11],[20,2,20,5],[22,7,22,11],[23,7,23,11],[12,5,12,11],[24,2,24,5],[20,7,20,11],[24,7,24,11],[21,7,21,11],[44,7,44,11],[45,7,45,11],[40,2,40,5],[44,2,44,5],[28,7,28,8],[37,7,37,8],[41,7,41,8],[42,7,42,8],[40,7,40,11],[32,7,32,11],[34,7,34,8],[35,7,35,8],[30,7,30,11],[31,7,31,11],[33,7,33,11],[15,2,15,11],[21,2,21,5],[23,2,23,5],[22,2,22,5],[45,2,45,5],[29,7,29,11],[38,7,38,11],[39,7,39,11],[43,7,43,8],[29,2,29,5],[30,2,30,5],[38,2,38,5],[39,2,39,5],[31,2,31,5],[32,2,32,5],[33,2,33,5]]}
[]
[]
[null,"Rúbricas Principios"]
[null,null,"Principios. Criterios de autoevaluación "]
[]
[null,null,"Escala de valoración ética del proceso estadístico de la OO.EE"]
[]
[null,null,"NA",null,null,"No aplica para el principio"]
{"$rows_left_out":39}
{"sheet":"Autoevaluación principios ","index":6,"n_rows":37,"n_cols":8,"rows_kept":37,"cut":false,"hidden":false,"merged":[[2,1,2,11],[9,1,10,1],[31,5,31,11],[34,5,34,11],[3,2,3,5],[5,2,5,11],[24,5,24,11],[25,5,25,11],[28,5,28,11],[29,5,29,11],[30,5,30,11],[35,5,35,11],[36,5,36,11],[11,5,11,11],[19,5,19,11],[27,5,27,11],[33,5,33,11],[12,5,12,11],[13,5,13,11],[14,5,14,11],[15,5,15,11],[16,5,16,11],[17,5,17,11],[20,5,20,11],[21,5,21,11],[22,5,22,11],[23,5,23,11]]}
[]
[]
[null,"Autoevaluación Principios"]
[null,"Código SETE",{"$f":"IFERROR(VLOOKUP(B4,'Información básica OO.EE'!C5:G5,2,0),\"\")","v":0}]
[]
[null,"Nombre OO.EE",{"$f":"IFERROR(VLOOKUP(B6,'Información básica OO.EE'!C10:L10,2,0),\"\")","v":0}]
[]
[null,"Apropiación de los Principios Éticos en la operación estadística"]
{"$rows_left_out":30}
{"sheet":"Riesgo No 1","index":7,"n_rows":30,"n_cols":6,"rows_kept":30,"cut":false,"hidden":false,"merged":[[4,2,5,2],[4,1,5,1],[22,2,22,5],[23,2,23,5],[24,2,24,5],[11,1,12,5],[13,1,13,5],[10,1,10,5],[25,2,25,5],[29,1,29,5],[6,1,9,1],[6,2,9,2],[15,1,27,1],[15,2,15,3],[16,2,16,5],[17,2,17,5],[19,2,19,5],[26,2,26,5],[27,2,27,5],[20,2,20,5],[21,2,21,5],[28,1,28,5],[18,2,18,5]]}
[]
[]
[null,"Riesgo No. 1","Irrespeto de la autonomía y privacidad de los individuos"]
[]
[null,"Calificación","NA","Riesgo alto","Riesgo medio","Riesgo bajo"]
[null,null,null,1,3,5]
["1.       Irrespeto de la autonomía y privacidad de los individuos  ",5,null,"Estará en riesgo alto si se cumple  alguna de las siguientes situaciones:","Estará en riesgo medio si se cumple con las siguientes condiciones:","Estará en riesgo bajo o si se cumple con las siguientes condiciones:"]
[null,null,null,"1. Los datos o resultados de la operación estadística son susceptibles de permitir la identificación directa o indirecta de individuos (personas o empresas) o grupos poblacionales específicos.","1. Existen protocolos de anonimización de la información producida por la operación estadística que impiden la identificación directa o indirecta de la información individual (de personas o empresas) o de grupos poblacionales específicos.","1. Existen protocolos de anonimización estandarizados de la información producida por la operación estadística los cuales se encuentran documentados, e impiden la identificación directa o indirecta de la información individual (de personas o empresas) o de poblaciones específicas."]
{"$rows_left_out":23}
{"sheet":"Riesgo No 2","index":8,"n_rows":18,"n_cols":6,"rows_kept":18,"cut":false,"hidden":false,"merged":[[5,1,6,1],[5,2,6,2],[16,1,16,5],[17,1,17,5],[7,1,10,1],[7,2,10,2],[9,5,10,5],[11,1,15,1],[11,2,11,5],[12,2,12,5],[13,2,13,5],[14,2,14,5],[15,2,15,5]]}
[]
[]
[]
[null,"Riesgo No. 2 ","Invisibilización y exclusión estadística"]
[]
[null,"Calificación","NA","Riesgo alto","Riesgo medio","Riesgo bajo"]
[null,null,null,1,3,5]
["2.       Invisibilización o exclusión estadística ",null,"Aplica a aquellas operaciones estadísticas donde los sujetos de investigación sean grupos que históricamente han sufrido discriminación o vulneración de sus derechos, o son sujetos de especial protección","Estará en riesgo alto si se cumple  alguna de las siguientes situaciones:","Estará en riesgo medio si se cumple con las siguientes condiciones:","Estará en riesgo bajo o si se cumple con las siguientes condiciones:"]
{"$rows_left_out":11}
{"sheet":"Riesgo No 3","index":9,"n_rows":19,"n_cols":6,"rows_kept":19,"cut":false,"hidden":false,"merged":[[6,1,7,1],[6,2,7,2],[17,1,17,5],[18,1,18,5],[8,1,10,1],[8,2,10,2],[11,1,16,1],[11,2,11,5],[12,2,12,5],[13,2,13,5],[14,2,14,5],[15,2,15,5],[16,2,16,5]]}
[]
[]
[]
[]
[null,"Riesgo No 3  ","Estigmatización y etiquetado"]
[]
[null,"Calificación","NA","Riesgo alto","Riesgo medio","Riesgo bajo"]
[null,null,null,1,3,5]
{"$rows_left_out":12}
{"sheet":"Riesgo No 4","index":10,"n_rows":23,"n_cols":6,"rows_kept":23,"cut":false,"hidden":false,"merged":[[5,1,6,1],[5,2,6,2],[21,1,21,5],[22,1,22,5],[20,2,20,5],[7,1,12,1],[7,2,12,2],[13,1,20,1],[13,2,13,5],[14,2,14,5],[15,2,15,5],[16,2,16,5],[17,2,17,5],[18,2,18,5],[19,2,19,5]]}
[]
[]
[]
[null,"Riesgo No 4","No pertinencia de la información estadística"]
[]
[null,"Calificación","NA","Riesgo alto","Riesgo medio","Riesgo bajo"]
[null,null,null,1,3,5]
["4.       No pertinencia de la información estadística ",null,"Siempre aplica","Estará en riesgo alto si se cumple  alguna de las siguientes situaciones:","Estará en riesgo medio si se cumple con las siguientes condiciones:","Estará en riesgo bajo o si se cumple con las siguientes condiciones:"]
{"$rows_left_out":16}
{"sheet":"Riesgo No 5","index":11,"n_rows":22,"n_cols":6,"rows_kept":22,"cut":false,"hidden":false,"merged":[[5,1,6,1],[5,2,6,2],[21,1,21,5],[7,1,10,1],[7,2,10,2],[11,1,19,1],[11,2,11,5],[12,2,12,5],[13,2,13,5],[14,2,14,5],[17,2,17,5],[18,2,18,5],[19,2,19,5],[20,1,20,5],[15,2,15,5],[16,2,16,5]]}
[]
[]
[]
[null,"Riesgo No 5: Mala comunicación"]
[]
[null,"Calificación","NA","Riesgo alto","Riesgo medio","Riesgo bajo"]
[null,null,null,1,3,5]
["5.       Mala comunicación ",null,"Siempre aplica","Estará en riesgo alto si se cumple  alguna de las siguientes situaciones:","Estará en riesgo medio si se cumple con las siguientes condiciones:","Estará en riesgo bajo o si se cumple con las siguientes condiciones:"]
{"$rows_left_out":15}
{"sheet":"Riesgo No 6","index":12,"n_rows":23,"n_cols":6,"rows_kept":23,"cut":false,"hidden":false,"merged":[[5,1,6,1],[5,2,6,2],[21,1,21,5],[22,1,22,5],[7,1,12,1],[7,2,12,2],[13,1,20,1],[13,2,13,5],[14,2,14,5],[15,2,15,5],[16,2,16,5],[18,2,18,5],[19,2,19,5],[20,2,20,5],[17,2,17,5]]}
[]
[]
[]
[null,"Riesgo No 6 ","Sesgo y manipulación"]
[]
[null,"Calificación","NA","Riesgo alto","Riesgo medio","Riesgo bajo"]
[null,null,null,1,3,5]
["6.       Sesgo y manipulación ",null,"Aplica a todas","Estará en riesgo alto si se cumple  alguna de las siguientes situaciones:","Estará en riesgo medio si se cumple con las siguientes condiciones:","Estará en riesgo bajo o si se cumple con las siguientes condiciones:"]
{"$rows_left_out":16}
{"sheet":"Riesgo No 7","index":13,"n_rows":28,"n_cols":6,"rows_kept":28,"cut":false,"hidden":false,"merged":[[27,1,27,5],[24,2,24,5],[25,2,25,5],[7,1,13,1],[7,2,13,2],[14,1,25,1],[14,2,14,5],[15,2,15,5],[19,2,19,5],[20,2,20,5],[21,2,21,5],[22,2,22,5],[18,2,18,5],[5,1,6,1],[5,2,6,2],[26,1,26,5],[17,2,17,5],[16,2,16,5],[23,2,23,5]]}
[]
[]
[]
[null,"Riesgo No 7 ","Falta de veracidad y opacidad"]
[]
[null,"Calificación","NA","Riesgo alto","Riesgo medio","Riesgo bajo"]
[null,null,null,1,3,5]
["7.       Falta de veracidad y opacidad  ",null,null,"Estará en riesgo alto si se cumple  alguna de las siguientes situaciones:","Estará en riesgo medio si se cumple con las siguientes condiciones:","Estará en riesgo bajo o si se cumple con las siguientes condiciones:"]
{"$rows_left_out":21}
{"sheet":"Riesgo No 8","index":14,"n_rows":22,"n_cols":6,"rows_kept":22,"cut":false,"hidden":false,"merged":[[21,1,21,5],[7,1,9,1],[7,2,9,2],[10,1,18,1],[10,2,10,5],[11,2,11,5],[12,2,12,5],[16,2,16,5],[17,2,17,5],[18,2,18,5],[5,1,6,1],[5,2,6,2],[20,1,20,5],[19,2,19,5],[13,2,13,5],[14,2,14,5],[15,2,15,5]]}
[]
[]
[]
[null,"Riesgo No 8 ","Uso inseguro de las tecnologías actuales y futuras"]
[]
[null,"Calificación","NA","Riesgo alto","Riesgo medio","Riesgo bajo"]
[null,null,null,1,3,5]
["8.       Uso inseguro de las tecnologías actuales y futuras ",null,null,"Estará en riesgo alto si se cumple  alguna de las siguientes situaciones:","Estará en riesgo medio si se cumple con las siguientes condiciones:","Estará en riesgo bajo o si se cumple con las siguientes condiciones:"]
{"$rows_left_out":15}
{"sheet":"Riesgo No 9","index":15,"n_rows":17,"n_cols":6,"rows_kept":17,"cut":false,"hidden":false,"merged":[[5,1,6,1],[5,2,6,2],[15,1,15,5],[7,1,9,1],[16,1,16,5],[10,1,14,1],[10,2,10,5],[11,2,11,5],[12,2,12,5],[13,2,13,5],[14,2,14,5],[7,2,9,2]]}
[]
[]
[]
[null,"Riesgo No 9: Abusos y perjuicios de los datos colaborativos"]
[]
[null,"Calificación","NA","Riesgo alto","Riesgo medio","Riesgo bajo"]
[null,null,null,1,3,5]
["9.       Abusos y perjuicios de los datos colaborativos",null,".","Estará en riesgo alto si se cumple  alguna de las siguientes situaciones:","Estará en riesgo medio si se cumple con las siguientes condiciones:","Estará en riesgo bajo o si se cumple con las siguientes condiciones:"]
{"$rows_left_out":9}